{"text_format":"1","workbook":"xlsx","n_sheets":3,"sheets":["start","data","template"],"not_rendered":{"charts":0,"images":0,"macros":1,"external_links":0,"defined_names":1,"comments":0,"pivot_tables":0},"unopened":[],"bounds":{"document_bytes":16777216,"sheet_cells":100000,"rows_first":2000,"rows_last":500,"rows_between":2000,"halvings":0,"cell_chars":16384,"cell_head_chars":4096},"cells_cut":0,"cells_raw":0,"read":"whole","date_system":"1900"}

{"sheet":"start","index":0,"n_rows":12,"n_cols":3,"rows_kept":12,"cut":false,"hidden":false,"merged":[[0,1,0,5]]}
[null,"Автоматизация создания ТТН"]
[]
[null,"Данные:","Лист data"]
[null,"Шаблон:","Лист template"]
[]
[]
[]
[]
[]
[]
[null,"Последний запуск:"]
[null,"Создано:"]

{"sheet":"data","index":1,"n_rows":13,"n_cols":28,"rows_kept":13,"cut":false,"hidden":false,"merged":[]}
[null,null,"На главную",null,null,"Шаблон"]
[null,null,null,2,3,4,5,6,7,8,9,10,11,12,13,14,15,16,17,18,19,20,21,22,23,24,25,26]
["дата","авто","id","номер","день","месяц","год","организация","марка_авто","гос_номер-авто","орг_владелец_авто","водитель_фио","заказчик","грузоотправитель","пункт_погрузки","грузополучатель","пункт_разгрузки","прицеп_гос_номер","продукция","брутто","тара","нетто","отпустил_должность","отпустил_фио","сдал_должность","сдал_фио","принял_фио_сокр","приложение"]
["2025-09-15","КАМАЗ О975ВВ761 СК214461",1,"9512",{"$f":"DAY(A4)","v":15},{"$f":"CHOOSE(MONTH(A4),\"января\",\"февраля\",\"марта\",\"апреля\",\"мая\",\"июня\",\"июля\",\"августа\",\"сентября\",\"октября\",\"ноября\",\"декабря\")","v":"сентября"},{"$f":"MOD(YEAR(A4),100)","v":25},"ООО \"АгроФлоу X1\"",{"$f":"LEFT(B4,FIND(\" \",B4)-1)","v":"КАМАЗ"},{"$f":"MID(B4,FIND(\" \",B4)+1,FIND(\" \",B4,FIND(\" \",B4)+1)-FIND(\" \",B4)-1)","v":"О975ВВ761"},"ООО \"ТрансВектор X1\"","Иванор Сергей Петрович",{"$f":"H4","v":"ООО \"АгроФлоу X1\""},"ООО \"АгроЭкспорт X9\"","Краснодарский край",{"$f":"H4","v":"ООО \"АгроФлоу X1\""},"Ростовская обл.",{"$f":"MID(B4,FIND(\" \",B4,FIND(\" \",B4)+1)+1,LEN(B4)-FIND(\" \",B4,FIND(\" \",B4)+1))","v":"СК214461"},"пшеница 3 класса",34600,15220,19380,"директор","Таргин Алексей Викторович","кладовщик","Сидорина М.А.",{"$f":"LEFT(L4,FIND(\" \",L4)-1) & \" \" &\nMID(L4,FIND(\" \",L4)+1,1) & \".\" &\nMID(L4,FIND(\" \",L4,FIND(\" \",L4)+1)+1,1) & \".\"","v":"Иванор С.П."},"Декларация соответствия"]
["2025-09-15","МАЗ А123МР777 ВЕ547391",2,"9513",{"$f":"DAY(A5)","v":15},{"$f":"CHOOSE(MONTH(A5),\"января\",\"февраля\",\"марта\",\"апреля\",\"мая\",\"июня\",\"июля\",\"августа\",\"сентября\",\"октября\",\"ноября\",\"декабря\")","v":"сентября"},{"$f":"MOD(YEAR(A5),100)","v":25},"ООО \"ЗерноПриём 24A\"",{"$f":"LEFT(B5,FIND(\" \",B5)-1)","v":"МАЗ"},{"$f":"MID(B5,FIND(\" \",B5)+1,FIND(\" \",B5,FIND(\" \",B5)+1)-FIND(\" \",B5)-1)","v":"А123МР777"},"ООО \"ГрузЛогистика 14A\"","Смирев Андрей Николаевич",{"$f":"H5","v":"ООО \"ЗерноПриём 24A\""},"ООО \"ЗерноОтгрузка 21A\"","Краснодарский край",{"$f":"H5","v":"ООО \"ЗерноПриём 24A\""},"Ростовская обл.","ВЕ547391","пшеница 3 класса",35120,14850,20270,"директор","Лемиров Сергей Андреевич","кладовщик","Петровина О.С.",{"$f":"LEFT(L5,FIND(\" \",L5)-1) & \" \" &\nMID(L5,FIND(\" \",L5)+1,1) & \".\" &\nMID(L5,FIND(\" \",L5,FIND(\" \",L5)+1)+1,1) & \".\"","v":"Смирев А.Н."},"Декларация соответствия"]
["2025-09-15","Мерседес М456ЕХ163 РТ932854",3,"9514",15,"сентября",25,"ООО \"ГрейнПорт-Х\"","Мерседес","М456ЕХ163","ООО \"АвтоЗерноПоток-Х\"","Кузнецын Алексей Викторович","ООО \"ГрейнПорт-Х\"","ООО \"ТрансАгроЛиния-Х\"","Краснодарский край","ООО \"ГрейнПорт-Х\"","Ростовская обл.","РТ932854","пшеница",33890,15640,18250,"директор","Неворин Дмитрий Олегович","кладовщик","Калинина Н.В.","Кузнецын А.В.","Декларация соответствия"]
["2025-10-20","КАМАЗ Т789АН402 МН678912",4,"9515",20,"октября",25,"ООО \"АгроЛогистик Z7\"","КАМАЗ","Т789АН402","ООО \"ЮгТрансСистема Q3\"","Попович Денис Олегович","ООО \"АгроЛогистик Z7\"","ООО \"ЮгПоставка Q8\"","Ставропольский край","ООО \"АгроЛогистик Z7\"","Ростовская обл.","МН678912","ячмень",35980,14320,21660,"директор","Заревский Павел Николаевич","кладовщик","Горина Е.А.","Попович Д.О.","Декларация соответствия"]
["2025-10-21","КАМАЗ В321ОО599 АП456782",5,"9516",21,"октября",25,"ООО \"ЮгЗерноСнаб X2\"","КАМАЗ","В321ОО599","ООО \"ГрейнТрансЛайн X8\"","Моргин Павел Сергеевич","ООО \"ЮгЗерноСнаб X2\"","ООО \"ГрейнСинтез 3X\"","Ставропольский край","ООО \"ЮгЗерноСнаб X2\"","Ростовская обл.","АП456782","ячмень",32750,15910,16840,"директор","Волягин Егор Дмитриевич","кладовщик","Таревская И.О.","Моргин П.С.","Декларация соответствия"]
["2025-10-22","МАЗ К654РМ750 ЕС327109",6,"9517",22,"октября",25,"ООО \"ПотокАгро Q1\"","МАЗ","К654РМ750","ООО \"АгроАвтоСинтез 6B\"","Калевин Денис Игоревич","ООО \"ПотокАгро Q1\"","ООО \"АгроВектор Z2\"","Ставропольский край","ООО \"ПотокАгро Q1\"","Ростовская обл.","ЕС327109","пшеница",34410,15180,19230,"директор","Крестовин Роман Алексеевич","кладовщик","Карпелин М.А.","Калевин Д.И.","Декларация соответствия"]
["2025-12-09","Мерседес Н987НН222 ТР894567",7,"9518",9,"декабря",25,"ООО \"ТерраГрейн 9X\"","Мерседес","Н987НН222","ООО \"ДорТрансАгро X2\"","Родевский Андрей Николаевич","ООО \"ТерраГрейн 9X\"","ООО \"ПоляТрейд X5\"","Краснодарский край","ООО \"ТерраГрейн 9X\"","Ростовская обл.","ТР894567","пшеница",35560,14790,20770,"директор","Орлинов Виктор Павлович","кладовщик","Новаров П.Н.","Родевский А.Н.","Декларация соответствия"]
["2026-01-23","Вольво С246ЕТ888 ОК213478",8,"9519",23,"января",26,"ООО \"ФермаТрейд-Х\"","Вольво","С246ЕТ888","ООО \"ЛогистикФлоу 19X\"","Семиров Артём Викторович","ООО \"ФермаТрейд-Х\"","ООО \"ЗерноЛайн-24B\"","Краснодарский край","ООО \"ФермаТрейд-Х\"","Ростовская обл.","ОК213478","кукуруза",33280,15460,17820,"директор","Белярев Кирилл Сергеевич","кладовщик","Сольцев А.В.","Семиров А.В.","Декларация соответствия"]
["2026-03-02","Вольво Р135РТ311 КМ765981",9,"9520",2,"марта",26,"ООО \"ЗерноХаб 17B\"","Вольво","Р135РТ311","ООО \"ЗерноМобиль V4\"","Горевин Максим Олегович","ООО \"ЗерноХаб 17B\"","ООО \"ФлоуАгро V1\"","Краснодарский край","ООО \"ЗерноХаб 17B\"","Ростовская обл.","КМ765981","кукуруза",34870,14950,19920,"директор","Снегиров Андрей Олегович","кладовщик","Ардентов И.С.","Горевин М.О.","Декларация соответствия"]
["2026-06-07","КАМАЗ У864УН049 СХ432156",10,"9521",7,"июня",26,"ООО \"АгроСклад V3\"",{"$f":"LEFT(B13,FIND(\" \",B13)-1)","v":"КАМАЗ"},"У864УН049","ООО \"ТрансЮгЭкспресс X9\"","Даневский Кирилл Андреевич","ООО \"АгроСклад V3\"","ООО \"АгроТерминал X7\"","Краснодарский край","ООО \"АгроСклад V3\"","Ростовская обл.","СХ432156","пшеница",36240,14130,22110,"директор","Ветровин Денис Игоревич","кладовщик","Родина В.А.","Даневский К.А.","Декларация соответствия"]

{"sheet":"template","index":2,"n_rows":113,"n_cols":109,"rows_kept":113,"cut":false,"hidden":false,"merged":[[112,79,112,107],[109,92,109,107],[110,0,111,17],[110,18,111,29],[110,30,111,41],[110,42,111,52],[110,53,111,65],[110,66,111,76],[110,92,110,107],[111,79,111,107],[109,0,109,17],[109,18,109,29],[109,30,109,41],[109,42,109,52],[109,53,109,65],[109,66,109,76],[103,0,106,17],[103,18,104,41],[103,42,106,52],[103,53,106,65],[103,66,106,76],[107,79,107,107],[108,0,108,17],[108,18,108,29],[108,30,108,41],[108,42,108,52],[108,53,108,65],[108,66,108,76],[108,79,108,107],[103,90,103,107],[105,18,106,29],[105,30,106,41],[105,79,105,107],[107,0,107,17],[107,18,107,29],[107,30,107,41],[107,42,107,52],[107,53,107,65],[107,66,107,76],[99,0,99,11],[99,12,99,23],[99,24,99,35],[99,38,99,53],[99,54,99,64],[99,65,99,77],[99,78,99,92],[99,93,99,107],[100,0,101,11],[100,12,101,23],[100,24,101,35],[100,37,100,53],[100,54,100,64],[100,65,100,77],[100,78,100,92],[100,93,100,107],[101,37,101,53],[101,54,101,64],[101,65,101,77],[101,78,101,92],[101,93,101,107],[95,0,96,23],[95,24,98,35],[95,36,98,53],[95,54,97,64],[95,65,97,77],[95,78,97,92],[95,93,97,107],[97,0,98,11],[97,12,98,23],[98,54,98,64],[98,65,98,77],[98,78,98,92],[98,93,98,107],[92,0,92,12],[92,13,92,25],[92,26,92,38],[92,39,92,51],[92,52,92,64],[92,65,92,77],[92,78,92,92],[92,93,92,107],[93,0,93,12],[93,13,93,25],[93,26,93,38],[93,39,93,51],[93,52,93,64],[93,65,93,77],[93,78,93,92],[93,93,93,107],[86,0,87,13],[86,14,87,31],[86,32,87,55],[86,58,86,107],[88,0,88,107],[90,0,90,64],[90,65,91,77],[90,78,90,107],[91,0,91,12],[91,13,91,25],[91,26,91,38],[91,39,91,51],[91,52,91,64],[91,78,91,92],[91,93,91,107],[83,0,83,13],[83,14,83,31],[83,32,83,55],[83,86,83,107],[84,0,85,13],[84,14,85,31],[84,32,85,55],[84,58,84,107],[79,0,80,31],[79,32,82,55],[80,78,80,107],[81,0,82,13],[81,14,82,31],[81,58,81,107],[77,0,77,13],[77,14,77,33],[77,34,77,53],[77,54,77,71],[77,72,77,89],[77,90,77,107],[76,0,76,13],[76,14,76,33],[76,34,76,53],[76,54,76,71],[76,72,76,89],[76,90,76,107],[75,0,75,13],[75,14,75,33],[75,34,75,53],[75,54,75,71],[75,72,75,89],[75,90,75,107],[70,0,70,107],[72,0,74,13],[72,14,74,33],[72,34,74,53],[72,54,72,107],[73,54,74,71],[73,72,74,89],[73,90,74,107],[67,8,67,27],[67,30,67,39],[67,42,67,62],[67,75,67,84],[67,87,67,107],[68,0,69,13],[68,16,69,23],[68,64,69,71],[69,24,69,59],[69,72,69,107],[66,8,66,27],[66,30,66,39],[66,42,66,62],[66,63,66,74],[66,75,66,84],[66,87,66,107],[60,13,60,74],[60,75,60,80],[60,81,60,95],[61,13,61,74],[64,57,65,74],[65,75,65,107],[54,18,54,48],[54,51,54,75],[54,78,54,103],[55,18,55,48],[55,51,55,75],[55,78,55,103],[48,76,50,86],[48,87,50,103],[59,7,59,19],[59,22,59,32],[59,35,59,50],[59,60,59,72],[59,75,59,85],[59,88,59,103],[56,37,56,61],[56,78,56,103],[57,37,57,61],[57,78,57,103],[58,7,58,19],[58,22,58,32],[58,35,58,50],[58,60,58,72],[58,75,58,85],[58,88,58,103],[49,1,49,7],[49,9,49,75],[50,9,50,75],[51,76,53,86],[51,87,53,103],[52,9,52,48],[52,49,52,57],[52,58,52,68],[46,20,46,33],[46,34,46,48],[46,49,46,57],[46,58,46,68],[46,69,46,79],[46,80,46,103],[52,69,52,75],[40,87,40,103],[41,5,41,19],[41,20,41,26],[41,27,41,35],[41,36,41,43],[41,44,41,52],[41,53,41,61],[45,20,45,33],[45,34,45,48],[45,49,45,57],[45,58,45,68],[45,69,45,79],[45,80,45,103],[41,62,41,70],[41,71,41,86],[41,87,41,103],[43,20,44,33],[43,34,44,48],[43,49,44,57],[43,58,44,68],[43,69,44,79],[43,80,44,103],[40,0,41,4],[40,5,40,19],[40,20,40,26],[40,27,40,35],[40,36,40,43],[40,44,40,52],[40,53,40,61],[40,62,40,70],[40,71,40,86],[39,0,39,19],[39,20,39,26],[39,27,39,35],[39,36,39,43],[39,44,39,52],[39,53,39,61],[39,62,39,70],[39,71,39,86],[39,87,39,103],[32,12,32,103],[33,12,33,103],[34,12,34,30],[34,47,34,65],[34,82,34,100],[36,0,38,19],[36,20,38,26],[36,27,38,35],[36,36,38,43],[36,44,36,70],[36,71,38,86],[36,87,38,103],[37,44,38,52],[37,53,38,61],[37,62,38,70],[25,94,27,103],[26,50,26,73],[28,32,29,39],[28,40,29,61],[28,78,30,88],[28,89,30,103],[17,94,18,98],[17,99,18,103],[18,11,18,69],[20,17,20,103],[21,17,21,103],[22,11,23,77],[22,94,24,103],[24,11,24,77],[12,14,12,93],[13,14,13,93],[15,11,15,93],[16,11,16,93],[17,11,17,69],[17,72,18,87],[17,89,18,93],[8,35,8,93],[9,35,9,93],[10,10,10,50],[10,54,10,93],[11,10,11,50],[11,54,11,93],[4,96,4,99],[4,100,4,103],[4,104,4,107],[5,13,5,83],[5,96,5,107],[6,18,6,31],[6,62,6,75],[6,96,6,107],[2,71,2,78],[2,96,2,107],[3,34,3,37],[3,40,3,51],[3,52,3,55],[3,56,3,59],[3,96,3,107]]}
[null,null,null,null,null,null,null,null,null,null,null,null,null,null,null,null,null,null,null,null,null,null,null,null,null,null,null,null,null,null,null,null,null,null,null,null,null,null,null,null,null,null,null,null,null,null,null,null,null,null,null,null,null,null,null,null,null,null,null,null,null,null,null,null,null,null,null,null,null,null,null,null,null,null,null,null,null,null,null,null,null,null,null,null,null,null,null,null,null,null,null,null,null,null,null,null,null,null,null,null,null,null,null,null,null,null,null,"Типовая межотраслевая форма № СП-31"]
[null,null,null,null,null,null,null,null,null,null,null,null,null,null,null,null,null,null,null,null,null,null,null,null,null,null,null,null,null,null,null,null,null,null,null,null,null,null,null,null,null,null,null,null,null,null,null,null,null,null,null,null,null,null,null,null,null,null,null,null,null,null,null,null,null,null,null,null,null,null,null,null,null,null,null,null,null,null,null,null,null,null,null,null,null,null,null,null,null,null,null,null,null,null,null,null,null,null,null,null,null,null,null,null,null,null,null,null,"На главную"]
[null,null,null,null,null,null,null,null,null,null,null,null,null,null,null,null,null,null,null,null,null,null,null,null,null,null,null,null,null,null,null,null,null,null,null,null,null,null,null,null,null,null,null,null,null,null,null,null,null,null,null,null,null,null,null,null,null,null,null,null,null,null,null,null,null,null,null,null,null,null,"ТОВАРНО-ТРАНСПОРТНАЯ НАКЛАДНАЯ (зерно) № ",{"$f":"IFERROR(INDEX(data!C:AB, MATCH($DE$1, data!C:C, 0), data!D2), \"\")","v":""},null,null,null,null,null,null,null,null,null,null,null,null,null,null,null,null,null,null,null,null,null,null,null,null,"Коды",null,null,null,null,null,null,null,null,null,null,null,"Лист data"]
[null,null,null,null,null,null,null,null,null,null,null,null,null,null,null,null,null,null,null,null,null,null,null,null,null,null,null,null,null,null,null,null,null,"\"",{"$f":"IFERROR(INDEX(data!C:AB, MATCH($DE$1, data!C:C, 0), data!E2), \"\")","v":""},null,null,null,"\"",null,{"$f":"IFERROR(INDEX(data!C:AB, MATCH($DE$1, data!C:C, 0), data!F2), \"\")","v":""},null,null,null,null,null,null,null,null,null,null,null,20,null,null,null,{"$f":"IFERROR(INDEX(data!C:AB, MATCH($DE$1, data!C:C, 0), data!G2), \"\")","v":""},null,null,null," г.",null,null,null,null,null,null,null,null,null,null,null,null,null,null,null,null,null,null,null,null,null,null,null,null,null,null,null,null,null,null,null,null,"Форма по ОКУД",null,null,"0325031"]
[null,null,null,null,null,null,null,null,null,null,null,null,null,null,null,null,null,null,null,null,null,null,null,null,null,null,null,null,null,null,null,null,null,null,null,null,null,null,null,null,null,null,null,null,null,null,null,null,null,null,null,null,null,null,null,null,null,null,null,null,null,null,null,null,null,null,null,null,null,null,null,null,null,null,null,null,null,null,null,null,null,null,null,null,null,null,null,null,null,null,null,null,null,"Дата составления"]
[null,"Организация",null,null,null,null,null,null,null,null,null,null,null,{"$f":"IFERROR(INDEX(data!C:AB, MATCH($DE$1, data!C:C, 0), data!H2), \"\")","v":""},null,null,null,null,null,null,null,null,null,null,null,null,null,null,null,null,null,null,null,null,null,null,null,null,null,null,null,null,null,null,null,null,null,null,null,null,null,null,null,null,null,null,null,null,null,null,null,null,null,null,null,null,null,null,null,null,null,null,null,null,null,null,null,null,null,null,null,null,null,null,null,null,null,null,null,null,null,null,null,"по ОКПО"]
[null,"Марка автомобиля",null,null,null,null,null,null,null,null,null,null,null,null,null,null,null,null,{"$f":"IFERROR(INDEX(data!C:AB, MATCH($DE$1, data!C:C, 0), data!I2), \"\")","v":""},null,null,null,null,null,null,null,null,null,null,null,null,null,null,"Государственный номерной знак",null,null,null,null,null,null,null,null,null,null,null,null,null,null,null,null,null,null,null,null,null,null,null,null,null,null,null,null,{"$f":"IFERROR(INDEX(data!C:AB, MATCH($DE$1, data!C:C, 0), data!J2), \"\")","v":""},null,null,null,null,null,null,null,null,null,null,null,null,null,null,null,null,null,null,null,null,null,null,null,null,null,null,null,null,null,null,"к путевому листу №"]
[null,null,null,null,null,null,null,null,null,null,null,null,null,null,null,null,null,null,null,null,null,null,null,null,null,null,null,null,null,null,null,null,null,null,null,null,null,null,null,null,null,null,null,null,null,null,null,null,null,null,null,null,null,null,null,null,null,null,null,null,null,null,null,null,null,null,null,null,null,null,null,null,null,null,null,null," "]
[null,"Организация-владелец автотранспорта",null,null,null,null,null,null,null,null,null,null,null,null,null,null,null,null,null,null,null,null,null,null,null,null,null,null,null,null,null,null,null,null,null,{"$f":"IFERROR(INDEX(data!C:AB, MATCH($DE$1, data!C:C, 0), data!K2), \"\")","v":""}]
[null,null,null,null,null,null,null,null,null,null,null,null,null,null,null,null,null,null,null,null,null,null,null,null,null,null,null,null,null,null,null,null,null,null,null,"(наименование, адрес, номер телефона)"]
[null,"Водитель",null,null,null,null,null,null,null,null,{"$f":"IFERROR(INDEX(data!C:AB, MATCH($DE$1, data!C:C, 0), data!L2), \"\")","v":""},null,null,null,null,null,null,null,null,null,null,null,null,null,null,null,null,null,null,null,null,null,null,null,null,null,null,null,null,null,null,null,null,null,null,null,null,null,null,null,null,null,null,null,"коммерческая"]
[null,"Заказчик",null,null,null,null,null,null,null,null,"(фамилия, имя, отчество)",null,null,null,null,null,null,null,null,null,null,null,null,null,null,null,null,null,null,null,null,null,null,null,null,null,null,null,null,null,null,null,null,null,null,null,null,null,null,null,null,null,null,null,"(вид перевозки)"]
[null,"(плательщик)",null,null,null,null,null,null,null,null,null,null,null,null,{"$f":"IFERROR(INDEX(data!C:AB, MATCH($DE$1, data!C:C, 0), data!M2), \"\")","v":""}]
[null,null,null,null,null,null,null,null,null,null,null,null,null,null,"(наименование, адрес, номер телефона)"]
[null,"Грузоот-"]
[null,"правитель",null,null,null,null,null,null,null,null,null,{"$f":"IFERROR(INDEX(data!C:AB, MATCH($DE$1, data!C:C, 0), data!N2), \"\")","v":""}]
[null,"Пункт",null,null,null,null,null,null,null,null,null,"(наименование, адрес, номер телефона)"]
[null,"погрузки",null,null,null,null,null,null,null,null,null,{"$f":"IFERROR(INDEX(data!C:AB, MATCH($DE$1, data!C:C, 0), data!O2), \"\")","v":""},null,null,null,null,null,null,null,null,null,null,null,null,null,null,null,null,null,null,null,null,null,null,null,null,null,null,null,null,null,null,null,null,null,null,null,null,null,null,null,null,null,null,null,null,null,null,null,null,null,null,null,null,null,null,null,null,null,null,null,null,"Отделение (цех),\nбригада, звено"]
[null,null,null,null,null,null,null,null,null,null,null,"(адрес)"]
[]
[null,"Грузополучатель",null,null,null,null,null,null,null,null,null,null,null,null,null,null,null,{"$f":"IFERROR(INDEX(data!C:AB, MATCH($DE$1, data!C:C, 0), data!P2), \"\")","v":""}]
[null,null,null,null,null,null,null,null,null,null,null,null,null,null,null,null,null,"(наименование, адрес, номер телефона)"]
[null,"Пункт",null,null,null,null,null,null,null,null,null,{"$f":"IFERROR(INDEX(data!C:AB, MATCH($DE$1, data!C:C, 0), data!Q2), \"\")","v":""}]
[null,"разгрузки",null,null,null,null,null,null,null,null,null,null,null,null,null,null,null,null,null,null,null,null,null,null,null,null,null,null,null,null,null,null,null,null,null,null,null,null,null,null,null,null,null,null,null,null,null,null,null,null,null,null,null,null,null,null,null,null,null,null,null,null,null,null,null,null,null,null,null,null,null,null,null,null,null,null,null,null,null,null,null,null,null,null,null,null,null,null,null,null,null,"Маршрут №"]
[null,null,null,null,null,null,null,null,null,null,null,"(адрес)"]
[]
[null,null,null,null,null,null,null,null,null,null,null,null,"Прицеп: Государственный номерной знак",null,null,null,null,null,null,null,null,null,null,null,null,null,null,null,null,null,null,null,null,null,null,null,null,null,null,null,null,null,null,null,null,null,null,null,null,null,{"$f":"IFERROR(INDEX(data!C:AB, MATCH($DE$1, data!C:C, 0), data!R2), \"\")","v":""},null,null,null,null,null,null,null,null,null,null,null,null,null,null,null,null,null,null,null,null,null,null,null,null,null,null,null,null,null,null,null,null,null,null,null,null,null,null,null,null,"Гаражный номер"]
[]
[null,null,null,null,null,null,null,null,null,null,null,null,"Сведения о грузе",null,null,null,null,null,null,null,null,null,null,null,null,null,null,null,null,null,null,null,"Счет\n(дебет)",null,null,null,null,null,null,null,null,null,null,null,null,null,null,null,null,null,null,null,null,null,null,null,null,null,null,null,null,null,null,null,null,null,null,null,null,null,null,null,null,null,null,null,null,null,"Счет\n(кредит)"]
[]
[]
[]
[null,"Продукция",null,null,null,null,null,null,null,null,null,null,{"$f":"IFERROR(INDEX(data!C:AB, MATCH($DE$1, data!C:C, 0), data!S2), \"\")","v":""}]
[null,null,null,null,null,null,null,null,null,null,null,null,"(наименование зерновых и масляничных культур, семян, трав)"]
[null,"Сорт, класс",null,null,null,null,null,null,null,null,null,null,null,null,null,null,null,null,null,null,null,null,null,null,null,null,null,null,null,null,null,null,null,null,"Засоренность",null,null,null,null,null,null,null,null,null,null,null,null,null,null,null,null,null,null,null,null,null,null,null,null,null,null,null,null,null,null,null," %",null,null,null,null,"Влажность",null,null,null,null,null,null,null,null,null,null,null,null,null,null,null,null,null,null,null,null,null,null,null,null,null,null,null,null,null," %"]
[]
["Операция",null,null,null,null,null,null,null,null,null,null,null,null,null,null,null,null,null,null,null,"Вид\nупа-\nковки",null,null,null,null,null,null,"Коли-\nчество",null,null,null,null,null,null,null,null,"Класс\nгруза",null,null,null,null,null,null,null,"Масса, кг",null,null,null,null,null,null,null,null,null,null,null,null,null,null,null,null,null,null,null,null,null,null,null,null,null,null,"Цена, руб. коп.",null,null,null,null,null,null,null,null,null,null,null,null,null,null,null,"Сумма, руб. коп."]
[null,null,null,null,null,null,null,null,null,null,null,null,null,null,null,null,null,null,null,null,null,null,null,null,null,null,null,null,null,null,null,null,null,null,null,null,null,null,null,null,null,null,null,null,"брутто",null,null,null,null,null,null,null,null,"тара",null,null,null,null,null,null,null,null,"нетто"]
[]
[null,null,null,null,null,null,null,null,null,null,null,null,null,null,null,null,null,null,null,null,1,null,null,null,null,null,null,2,null,null,null,null,null,null,null,null,3,null,null,null,null,null,null,null,4,null,null,null,null,null,null,null,null,5,null,null,null,null,null,null,null,null,6,null,null,null,null,null,null,null,null,7,null,null,null,null,null,null,null,null,null,null,null,null,null,null,null,8]
{"$rows_left_out":73}